Reaction Details
TargetMetabotropic glutamate receptor 1
LigandBDBM50177080
Substrate/Competitorn/a
Meas. Tech.ChEMBL_406111 (CHEMBL912698)
IC50 1±n/a nM
Citation Zheng, GZBhatia, PKolasa, TPatel, MEl Kouhen, OFChang, RUchic, MEMiller, LBaker, SLehto, SGHonore, PWetter, JMMarsh, KCMoreland, RBBrioni, JDStewart, AO Correlation between brain/plasma ratios and efficacy in neuropathic pain models of selective metabotropic glutamate receptor 1 antagonists. Bioorg Med Chem Lett16:4936-40 (2006) 
 
Metabotropic glutamate receptor 1
Name:Metabotropic glutamate receptor 1
Type:Enzyme Catalytic Domain
Mol. Mass.:133240.47
Organism:RAT
Description:metabotropic glutamate 1/2 0 RAT::P23385
Residue:1199
BDBM50177080
NameBDBM50177080
Synonyms:3-azepan-1-yl-9-dimethylamino-3H-pyrido[3',2':4,5]thieno[3,2-d]pyrimidin-4-one CHEMBL386565
TypeSmall organic molecule
Emp. Form.C17H21N5OS
Mol. Mass.343.447
SMILESCN(C)c1ccnc2sc3c(ncn(N4CCCCCC4)c3=O)c12