Reaction Details
TargetProstaglandin G/H synthase 2
LigandBDBM23926
Substrate/Competitorn/a
Meas. Tech.ChEMBL_403702 (CHEMBL868099)
IC50 3490±n/a nM
Citation Tsai, WJShiao, YJLin, SJChiou, WFLin, LCYang, THTeng, CMWu, TSYang, LM Selective COX-2 inhibitors. Part 1: synthesis and biological evaluation of phenylazobenzenesulfonamides. Bioorg Med Chem Lett16:4440-3 (2006) 
 
Prostaglandin G/H synthase 2
Name:Prostaglandin G/H synthase 2
Type:Protein
Mol. Mass.:68976.98
Organism:Ovis aries (Sheep)
Description:n/a
Residue:603
BDBM23926
NameBDBM23926
Synonyms:(E)-resveratrol CHEMBL165 Stilbene, 2f cid_445154 trans-resveratrol
TypeSmall organic molecule
Emp. Form.C14H12O3
Mol. Mass.228.2433
SMILESOc1ccc(\C=C\c2cc(O)cc(O)c2)cc1