Reaction Details
TargetProstaglandin G/H synthase 2
LigandBDBM50140278
Substrate/Competitorn/a
Meas. Tech.ChEMBL_403699 (CHEMBL869264)
IC50 2040±n/a nM
Citation Tsai, WJShiao, YJLin, SJChiou, WFLin, LCYang, THTeng, CMWu, TSYang, LM Selective COX-2 inhibitors. Part 1: synthesis and biological evaluation of phenylazobenzenesulfonamides. Bioorg Med Chem Lett16:4440-3 (2006) 
 
Prostaglandin G/H synthase 2
Name:Prostaglandin G/H synthase 2
Type:Enzyme
Mol. Mass.:69003.89
Organism:Homo sapiens (Human)
Description:Recombinant Cox-2 provided by Cayman (Cayman Chemical Co.,Ann Arbor, MI).
Residue:604
BDBM50140278
NameBDBM50140278
Synonyms:4-((E)-4-Amino-2-methylsulfanyl-phenylazo)-benzenesulfonamide CHEMBL17161
TypeSmall organic molecule
Emp. Form.C13H14N4O2S2
Mol. Mass.322.406
SMILESCSc1cc(N)ccc1\N=N\c1ccc(cc1)S(N)(=O)=O