Reaction Details
TargetDeoxyuridine 5'-triphosphate nucleotidohydrolase
LigandBDBM50190551
Substrate/Competitorn/a
Meas. Tech.ChEMBL_373621 (CHEMBL869761)
Ki 44000±n/a nM
Citation Nguyen, CRuda, GFSchipani, AKasinathan, GLeal, IMusso-Buendia, AKaiser, MBrun, RRuiz-Pérez, LMSahlberg, BLJohansson, NGGonzalez-Pacanowska, DGilbert, IH Acyclic nucleoside analogues as inhibitors of Plasmodium falciparum dUTPase. J Med Chem49:4183-95 (2006) 
 
Deoxyuridine 5'-triphosphate nucleotidohydrolase
Name:Deoxyuridine 5'-triphosphate nucleotidohydrolase
Synonyms:dUTP pyrophosphatase
Type:Protein
Mol. Mass.:19574.43
Organism:Plasmodium falciparum
Description:Q8II92
Residue:173
BDBM50190551
NameBDBM50190551
TypeSmall organic molecule
Emp. Form.C13H24N2O4Si
Mol. Mass.300.4262
SMILESCC(C)(C)[Si](C)(C)OCCOCn1ccc(=O)[nH]c1=O