Reaction Details
TargetDeoxyuridine 5'-triphosphate nucleotidohydrolase, mitochondrial
LigandBDBM50190556
Substrate/Competitorn/a
Meas. Tech.ChEMBL_373622 (CHEMBL869762)
Ki 1400±n/a nM
Citation Nguyen, CRuda, GFSchipani, AKasinathan, GLeal, IMusso-Buendia, AKaiser, MBrun, RRuiz-Pérez, LMSahlberg, BLJohansson, NGGonzalez-Pacanowska, DGilbert, IH Acyclic nucleoside analogues as inhibitors of Plasmodium falciparum dUTPase. J Med Chem49:4183-95 (2006) 
 
Deoxyuridine 5'-triphosphate nucleotidohydrolase, mitochondrial
Name:Deoxyuridine 5'-triphosphate nucleotidohydrolase, mitochondrial
Type:Enzyme
Mol. Mass.:26574.03
Organism:Homo sapiens (Human)
Description:P33316
Residue:252
BDBM50190556
NameBDBM50190556
Synonyms:1-(3-tritylaminopropyl)uracil | CHEMBL211905
TypeSmall organic molecule
Emp. Form.C26H25N3O2
Mol. Mass.411.4956
SMILESO=c1ccn(CCCNC(c2ccccc2)(c2ccccc2)c2ccccc2)c(=O)[nH]1