Reaction Details
TargetDeoxyuridine 5'-triphosphate nucleotidohydrolase
LigandBDBM50190550
Substrate/Competitorn/a
Meas. Tech.ChEMBL_373621 (CHEMBL869761)
Ki 2000±n/a nM
Citation Nguyen, CRuda, GFSchipani, AKasinathan, GLeal, IMusso-Buendia, AKaiser, MBrun, RRuiz-Pérez, LMSahlberg, BLJohansson, NGGonzalez-Pacanowska, DGilbert, IH Acyclic nucleoside analogues as inhibitors of Plasmodium falciparum dUTPase. J Med Chem49:4183-95 (2006) 
 
Deoxyuridine 5'-triphosphate nucleotidohydrolase
Name:Deoxyuridine 5'-triphosphate nucleotidohydrolase
Synonyms:dUTP pyrophosphatase
Type:Protein
Mol. Mass.:19574.43
Organism:Plasmodium falciparum
Description:Q8II92
Residue:173
BDBM50190550
NameBDBM50190550
TypeSmall organic molecule
Emp. Form.C28H28N2O3
Mol. Mass.440.5335
SMILESO=c1ccn(CCCCCOC(c2ccccc2)(c2ccccc2)c2ccccc2)c(=O)[nH]1