Reaction Details
TargetDeoxyuridine 5'-triphosphate nucleotidohydrolase, mitochondrial
LigandBDBM50190549
Substrate/Competitorn/a
Meas. Tech.ChEMBL_373622 (CHEMBL869762)
Ki 5700±n/a nM
Citation Nguyen, CRuda, GFSchipani, AKasinathan, GLeal, IMusso-Buendia, AKaiser, MBrun, RRuiz-Pérez, LMSahlberg, BLJohansson, NGGonzalez-Pacanowska, DGilbert, IH Acyclic nucleoside analogues as inhibitors of Plasmodium falciparum dUTPase. J Med Chem49:4183-95 (2006) 
 
Deoxyuridine 5'-triphosphate nucleotidohydrolase, mitochondrial
Name:Deoxyuridine 5'-triphosphate nucleotidohydrolase, mitochondrial
Type:Enzyme
Mol. Mass.:26574.03
Organism:Homo sapiens (Human)
Description:P33316
Residue:252
BDBM50190549
NameBDBM50190549
Synonyms:1-[4-hydroxy-3-(tritylaminomethyl)butyl]uracil | CHEMBL378101
TypeSmall organic molecule
Emp. Form.C28H29N3O3
Mol. Mass.455.5482
SMILESOCC(CCn1ccc(=O)[nH]c1=O)CNC(c1ccccc1)(c1ccccc1)c1ccccc1