Reaction Details
Target5-hydroxytryptamine receptor 3A/3B/3C/3D/3E
LigandBDBM50190785
Substrate/Competitorn/a
Meas. Tech.ChEMBL_369000 (CHEMBL870923)
Ki 188±n/a nM
Citation Wishka, DGWalker, DPYates, KMReitz, SCJia, SMyers, JKOlson, KLJacobsen, EJWolfe, MLGroppi, VEHanchar, AJThornburgh, BACortes-Burgos, LAWong, EHStaton, BARaub, TJHigdon, NRWall, TMHurst, RSWalters, RRHoffmann, WEHajos, MFranklin, SCarey, GGold, LHCook, KKSands, SBZhao, SXSoglia, JRKalgutkar, ASArneric, SPRogers, BN Discovery of N-[(3R)-1-azabicyclo[2.2.2]oct-3-yl]furo[2,3-c]pyridine-5-carboxamide, an agonist of the alpha7 nicotinic acetylcholine receptor, for the potential treatment of cognitive deficits in schizophrenia: synthesis and structure--activity relationship. J Med Chem49:4425-36 (2006) 
 
5-hydroxytryptamine receptor 3A/3B/3C/3D/3E
Name:5-hydroxytryptamine receptor 3A/3B/3C/3D/3E
Type:n/a
Mol. Mass.:n/a
Description:ASSAY_ID of EBI is 3422
Components:This complex has 5 components.
Component 1
Name:5-hydroxytryptamine receptor 3A
Synonyms:5-HT-3 5-HT3A 5-hydroxytryptamine receptor 3 (5-HT3) 5-hydroxytryptamine receptor 3A (5HT3A) 5HT3R HTR3A Serotonin 3 receptor (5HT3) Serotonin-gated ion channel receptor | Serotonin-gated ion channel receptor 3
Type:Protein
Mol. Mass.:55283.27
Organism:Homo sapiens (Human)
Description:P46098
Residue:478
Component 2
Name:5-hydroxytryptamine receptor 3B
Synonyms:5-HT-3B 5-hydroxytryptamine receptor 3B HTR3B Serotonin receptor 3B
Type:PROTEIN
Mol. Mass.:50281.60
Organism:Homo sapiens (Human)
Description:EBI_11305
Residue:441
Component 3
Name:5-hydroxytryptamine receptor 3C
Synonyms:5HT3C_HUMAN Serotonin (5-HT3) receptor
Type:PROTEIN
Mol. Mass.:50216.00
Organism:Homo sapiens (Human)
Description:EBI_12117
Residue:447
Component 4
Name:5-hydroxytryptamine receptor 3D
Synonyms:5HT3D_HUMAN Serotonin (5-HT3) receptor
Type:PROTEIN
Mol. Mass.:50209.16
Organism:Homo sapiens (Human)
Description:EBI_12960
Residue:454
Component 5
Name:5-hydroxytryptamine receptor 3E
Synonyms:5HT3E_HUMAN Serotonin (5-HT3) receptor
Type:PROTEIN
Mol. Mass.:51440.34
Organism:Homo sapiens (Human)
Description:EBI_14002
Residue:456
BDBM50190785
NameBDBM50190785
Synonyms:CHEMBL378349 | N-[(3R)-1-azabicyclo[2.2.2]oct-3-yl]-1-benzothiophene-6-carboxamide
TypeSmall organic molecule
Emp. Form.C16H18N2OS
Mol. Mass.286.392
SMILESO=C(N[C@H]1CN2CCC1CC2)c1ccc2ccsc2c1