Reaction Details
TargetSubstance-P receptor
LigandBDBM50049469
Substrate/Competitorn/a
Meas. Tech.ChEMBL_405761 (CHEMBL869873)
IC50 0.09±n/a nM
Citation Finke, PEMeurer, LCLevorse, DAMills, SGMaccoss, MSadowski, SCascieri, MATsao, KLChicchi, GGMetzger, JMMacintyre, DE Cyclopentane-based human NK1 antagonists. Part 1: discovery and initial SAR. Bioorg Med Chem Lett16:4497-503 (2006) 
 
Substance-P receptor
Name:Substance-P receptor
Type:G Protein-Coupled Receptor (GPCR)
Mol. Mass.:46254.43
Organism:Homo sapiens (Human)
Description:P25103
Residue:407
BDBM50049469
NameBDBM50049469
Synonyms:5-(((2S,3S)-2-(3,5-bis(trifluoromethyl)benzyloxy)-3-phenylmorpholino)methyl)-2H-1,2,4-triazol-3(4H)-one CHEMBL52330
TypeSmall organic molecule
Emp. Form.C22H20F6N4O3
Mol. Mass.502.4096
SMILESFC(F)(F)c1cc(CO[C@H]2OCCN(Cc3n[nH]c(=O)[nH]3)[C@H]2c2ccccc2)cc(c1)C(F)(F)F