Reaction Details
TargetDelta-type opioid receptor
LigandBDBM50191058
Substrate/Competitorn/a
Meas. Tech.ChEMBL_401403 (CHEMBL855304)
IC50 450±n/a nM
Citation Petrov, RRVardanyan, RSLee, YSMa, SWDavis, PBegay, LJLai, JYPorreca, FHruby, VJ Synthesis and evaluation of 3-aminopropionyl substituted fentanyl analogues for opioid activity. Bioorg Med Chem Lett16:4946-50 (2006) 
 
Delta-type opioid receptor
Name:Delta-type opioid receptor
Type:G Protein-Coupled Receptor (GPCR)
Mol. Mass.:40382.98
Organism:Homo sapiens (Human)
Description:Competition binding assays were carried out using membrane preparations from transfected HN9.10 cells that constitutively expressed the delta opioid receptor.
Residue:372
BDBM50191058
NameBDBM50191058
Synonyms:CHEMBL214285 | N-(1-phenethyl-piperidin-4-yl)-N-phenyl-3-propionylamino-propionamide
TypeSmall organic molecule
Emp. Form.C25H33N3O2
Mol. Mass.407.5484
SMILESCCC(=O)NCCC(=O)N(C1CCN(CCc2ccccc2)CC1)c1ccccc1