Reaction Details
TargetMu-type opioid receptor
LigandBDBM50191053
Substrate/Competitorn/a
Meas. Tech.ChEMBL_401402 (CHEMBL855303)
IC50 30±n/a nM
Citation Petrov, RRVardanyan, RSLee, YSMa, SWDavis, PBegay, LJLai, JYPorreca, FHruby, VJ Synthesis and evaluation of 3-aminopropionyl substituted fentanyl analogues for opioid activity. Bioorg Med Chem Lett16:4946-50 (2006) 
 
Mu-type opioid receptor
Name:Mu-type opioid receptor
Type:G Protein-Coupled Receptor (GPCR)
Mol. Mass.:44503.11
Organism:Rattus norvegicus (rat)
Description:Competition binding assays were carried out using membrane preparations from transfected HN9.10 cells that constitutively expressed the mu opioid receptor.
Residue:398
BDBM50191053
NameBDBM50191053
Synonyms:1-ethyl-3-(3-oxo-3-((1-phenethylpiperidin-4-yl)(phenyl)amino)propyl)urea | CHEMBL385909
TypeSmall organic molecule
Emp. Form.C25H34N4O2
Mol. Mass.422.5631
SMILESCCNC(=O)NCCC(=O)N(C1CCN(CCc2ccccc2)CC1)c1ccccc1