Reaction Details
TargetBeta-lactamase
LigandBDBM50191382
Substrate/Competitorn/a
Meas. Tech.ChEMBL_365445 (CHEMBL869112)
IC50 18±n/a nM
Citation Venkatesan, AMAgarwal, AAbe, TUshirogochi, HYamamura, IAdo, MTsuyoshi, TDos Santos, OGu, YSum, FWLi, ZFrancisco, GLin, YIPetersen, PJYang, YKumagai, TWeiss, WJShlaes, DMKnox, JRMansour, TS Structure-activity relationship of 6-methylidene penems bearing 6,5 bicyclic heterocycles as broad-spectrum beta-lactamase inhibitors: evidence for 1,4-thiazepine intermediates with C7 R stereochemistry by computational methods. J Med Chem49:4623-37 (2006) 
 
Beta-lactamase
Name:Beta-lactamase
Type:PROTEIN
Mol. Mass.:41306.67
Organism:Enterobacter cloacae
Description:ChEMBL_40258
Residue:381
BDBM50191382
NameBDBM50191382
Synonyms:(5R,6Z)-7-oxo-6-{[5-(pyridin-3-ylmethyl)-4,5,6,7-tetrahydrothieno[3,2-c]pyridin-2-yl)]methylene}-7oxo-4-thia-1-azabicyclo[3.2.0]hept-2-ene-2-carboxylic acid sodium salt | CHEMBL211143
TypeSmall organic molecule
Emp. Form.C20H16N3O3S2
Mol. Mass.410.49
SMILES[O-]C(=O)C1=CS[C@H]2N1C(=O)\C2=C\c1cc2CN(Cc3cccnc3)CCc2s1