Reaction Details
TargetBeta-lactamase TEM
LigandBDBM50191380
Substrate/Competitorn/a
Meas. Tech.ChEMBL_365442 (CHEMBL869109)
IC50 5±n/a nM
Citation Venkatesan, AMAgarwal, AAbe, TUshirogochi, HYamamura, IAdo, MTsuyoshi, TDos Santos, OGu, YSum, FWLi, ZFrancisco, GLin, YIPetersen, PJYang, YKumagai, TWeiss, WJShlaes, DMKnox, JRMansour, TS Structure-activity relationship of 6-methylidene penems bearing 6,5 bicyclic heterocycles as broad-spectrum beta-lactamase inhibitors: evidence for 1,4-thiazepine intermediates with C7 R stereochemistry by computational methods. J Med Chem49:4623-37 (2006) 
 
Beta-lactamase TEM
Name:Beta-lactamase TEM
Type:Enzyme
Mol. Mass.:31512.33
Organism:Escherichia coli
Description:P62593
Residue:286
BDBM50191380
NameBDBM50191380
Synonyms:CHEMBL379440 | sodium (R,E)-7-oxo-6-((5,6,7,8-tetrahydroimidazo[1,2-a]pyrazin-2-yl)methylene)-4-thia-1-aza-bicyclo[3.2.0]hept-2-ene-2-carboxylate
TypeSmall organic molecule
Emp. Form.C13H11N4O3S
Mol. Mass.303.317
SMILES[O-]C(=O)C1=CS[C@H]2N1C(=O)\C2=C/c1cn2CCNCc2n1