Reaction Details
TargetRNA-directed RNA polymerase
LigandBDBM50191513
Substrate/Competitorn/a
Meas. Tech.ChEMBL_376990 (CHEMBL866684)
IC50 24±n/a nM
Citation Hirashima, SSuzuki, TIshida, TNoji, SYata, SAndo, IKomatsu, MIkeda, SHashimoto, H Benzimidazole derivatives bearing substituted biphenyls as hepatitis C virus NS5B RNA-dependent RNA polymerase inhibitors: structure-activity relationship studies and identification of a potent and highly selective inhibitor JTK-109. J Med Chem49:4721-36 (2006) 
 
RNA-directed RNA polymerase
Name:RNA-directed RNA polymerase
Type:Protein
Mol. Mass.:25173.95
Organism:Hepatitis C virus
Description:Q8JXU8
Residue:229
BDBM50191513
NameBDBM50191513
Synonyms:2-[4-(4-carboxy-4'-chlorobiphenyl-2-ylmethoxy)phenyl]-1-cyclohexyl-1H-benzimidazole-5-carboxylic acid | CHEMBL376462
TypeSmall organic molecule
Emp. Form.C34H29ClN2O5
Mol. Mass.581.057
SMILESOC(=O)c1ccc(c(COc2ccc(cc2)-c2nc3cc(ccc3n2C2CCCCC2)C(O)=O)c1)-c1ccc(Cl)cc1