Reaction Details
TargetRNA-directed RNA polymerase
LigandBDBM50191521
Substrate/Competitorn/a
Meas. Tech.ChEMBL_376990 (CHEMBL866684)
IC50 150±n/a nM
Citation Hirashima, SSuzuki, TIshida, TNoji, SYata, SAndo, IKomatsu, MIkeda, SHashimoto, H Benzimidazole derivatives bearing substituted biphenyls as hepatitis C virus NS5B RNA-dependent RNA polymerase inhibitors: structure-activity relationship studies and identification of a potent and highly selective inhibitor JTK-109. J Med Chem49:4721-36 (2006) 
 
RNA-directed RNA polymerase
Name:RNA-directed RNA polymerase
Type:Protein
Mol. Mass.:25173.95
Organism:Hepatitis C virus
Description:Q8JXU8
Residue:229
BDBM50191521
NameBDBM50191521
Synonyms:2-{4-[3-(4-chlorophenyl)pyridin-2-ylmethoxy]phenyl}-1-cyclohexyl-1H-benzimidazole-5-carboxylic acid | CHEMBL378524
TypeSmall organic molecule
Emp. Form.C32H28ClN3O3
Mol. Mass.538.036
SMILESOC(=O)c1ccc2n(C3CCCCC3)c(nc2c1)-c1ccc(OCc2ncccc2-c2ccc(Cl)cc2)cc1