Reaction Details
TargetDNA polymerase beta
LigandBDBM50191511
Substrate/Competitorn/a
Meas. Tech.ChEMBL_377004 (CHEMBL868559)
IC50>10000±n/a nM
Citation Hirashima, SSuzuki, TIshida, TNoji, SYata, SAndo, IKomatsu, MIkeda, SHashimoto, H Benzimidazole derivatives bearing substituted biphenyls as hepatitis C virus NS5B RNA-dependent RNA polymerase inhibitors: structure-activity relationship studies and identification of a potent and highly selective inhibitor JTK-109. J Med Chem49:4721-36 (2006) 
 
DNA polymerase beta
Name:DNA polymerase beta
Type:Protein
Mol. Mass.:38188.76
Organism:Homo sapiens (Human)
Description:n/a
Residue:335
BDBM50191511
NameBDBM50191511
Synonyms:2-{4-[4'-chloro-4-(2-oxo-pyrrolidin-1-yl)-biphenyl-2-ylmethoxy]-2-fluoro-phenyl}-1-cyclohexyl-1H-benzoimidazole-5-carboxylic acid CHEMBL210297
TypeSmall organic molecule
Emp. Form.C37H33ClFN3O4
Mol. Mass.638.127
SMILESOC(=O)c1ccc2n(C3CCCCC3)c(nc2c1)-c1ccc(OCc2cc(ccc2-c2ccc(Cl)cc2)N2CCCC2=O)cc1F