Reaction Details
TargetOxysterols receptor LXR-beta
LigandBDBM50192149
Substrate/Competitorn/a
Meas. Tech.ChEMBL_406040 (CHEMBL912144)
IC50 20±n/a nM
Citation Panday, NBenz, JBlum-Kaelin, DBourgeaux, VDehmlow, HHartman, PKuhn, BRatni, HWarot, XWright, MB Synthesis and evaluation of anilinohexafluoroisopropanols as activators/modulators of LXRalpha and beta. Bioorg Med Chem Lett16:5231-7 (2006) 
 
Oxysterols receptor LXR-beta
Name:Oxysterols receptor LXR-beta
Type:Enzyme Catalytic Domain
Mol. Mass.:50978.79
Organism:Homo sapiens (Human)
Description:P55055
Residue:460
BDBM50192149
NameBDBM50192149
Synonyms:CHEMBL215130 | methyl 4-(2-((2-chloro-4-(1,1,1,3,3,3-hexafluoro-2-hydroxypropan-2-yl)phenyl)(ethyl)amino)-2-phenylethoxy)benzoate
TypeSmall organic molecule
Emp. Form.C27H24ClF6NO4
Mol. Mass.575.927
SMILESCCN(C(COc1ccc(cc1)C(=O)OC)c1ccccc1)c1ccc(cc1Cl)C(O)(C(F)(F)F)C(F)(F)F