Reaction Details
TargetOxysterols receptor LXR-beta
LigandBDBM50192142
Substrate/Competitorn/a
Meas. Tech.ChEMBL_406040 (CHEMBL912144)
IC50 50±n/a nM
Citation Panday, NBenz, JBlum-Kaelin, DBourgeaux, VDehmlow, HHartman, PKuhn, BRatni, HWarot, XWright, MB Synthesis and evaluation of anilinohexafluoroisopropanols as activators/modulators of LXRalpha and beta. Bioorg Med Chem Lett16:5231-7 (2006) 
 
Oxysterols receptor LXR-beta
Name:Oxysterols receptor LXR-beta
Type:Enzyme Catalytic Domain
Mol. Mass.:50978.79
Organism:Homo sapiens (Human)
Description:P55055
Residue:460
BDBM50192142
NameBDBM50192142
Synonyms:1,1,1,3,3,3-hexafluoro-2-(4-(methyl(thiazol-4-ylmethyl)amino)phenyl)propan-2-ol | CHEMBL386174
TypeSmall organic molecule
Emp. Form.C15H14F6N2OS
Mol. Mass.384.34
SMILESCCN(Cc1cscn1)c1ccc(cc1)C(O)(C(F)(F)F)C(F)(F)F