Reaction Details
TargetOxysterols receptor LXR-beta
LigandBDBM50192126
Substrate/Competitorn/a
Meas. Tech.ChEMBL_406040 (CHEMBL912144)
IC50 20±n/a nM
Citation Panday, NBenz, JBlum-Kaelin, DBourgeaux, VDehmlow, HHartman, PKuhn, BRatni, HWarot, XWright, MB Synthesis and evaluation of anilinohexafluoroisopropanols as activators/modulators of LXRalpha and beta. Bioorg Med Chem Lett16:5231-7 (2006) 
 
Oxysterols receptor LXR-beta
Name:Oxysterols receptor LXR-beta
Type:Enzyme Catalytic Domain
Mol. Mass.:50978.79
Organism:Homo sapiens (Human)
Description:P55055
Residue:460
BDBM50192126
NameBDBM50192126
Synonyms:1,1,1,3,3,3-hexafluoro-2-(4-(((5-methyl-2-(3-(trifluoromethyl)phenyl)oxazol-4-yl)methyl)(2,2,2-trifluoroethyl)amino)phenyl)propan-2-ol | CHEMBL215042
TypeSmall organic molecule
Emp. Form.C23H16F12N2O2
Mol. Mass.580.3662
SMILESCc1oc(nc1CN(CC(F)(F)F)c1ccc(cc1)C(O)(C(F)(F)F)C(F)(F)F)-c1cccc(c1)C(F)(F)F