Reaction Details
TargetOxysterols receptor LXR-alpha
LigandBDBM50192136
Substrate/Competitorn/a
Meas. Tech.ChEMBL_406041 (CHEMBL912145)
EC50 200±n/a nM
Citation Panday, NBenz, JBlum-Kaelin, DBourgeaux, VDehmlow, HHartman, PKuhn, BRatni, HWarot, XWright, MB Synthesis and evaluation of anilinohexafluoroisopropanols as activators/modulators of LXRalpha and beta. Bioorg Med Chem Lett16:5231-7 (2006) 
 
Oxysterols receptor LXR-alpha
Name:Oxysterols receptor LXR-alpha
Type:Enzyme Catalytic Domain
Mol. Mass.:50403.85
Organism:Homo sapiens (Human)
Description:Q13133
Residue:447
BDBM50192136
NameBDBM50192136
Synonyms:2-(4-(ethyl((5-methyl-2-(3-(trifluoromethyl)phenyl)oxazol-4-yl)methyl)amino)phenyl)-1,1,1,3,3,3-hexafluoropropan-2-ol | CHEMBL214867
TypeSmall organic molecule
Emp. Form.C23H19F9N2O2
Mol. Mass.526.3948
SMILESCCN(Cc1nc(oc1C)-c1cccc(c1)C(F)(F)F)c1ccc(cc1)C(O)(C(F)(F)F)C(F)(F)F