Reaction Details
TargetOxysterols receptor LXR-alpha
LigandBDBM50192109
Substrate/Competitorn/a
Meas. Tech.ChEMBL_406041 (CHEMBL912145)
EC50 100±n/a nM
Citation Panday, NBenz, JBlum-Kaelin, DBourgeaux, VDehmlow, HHartman, PKuhn, BRatni, HWarot, XWright, MB Synthesis and evaluation of anilinohexafluoroisopropanols as activators/modulators of LXRalpha and beta. Bioorg Med Chem Lett16:5231-7 (2006) 
 
Oxysterols receptor LXR-alpha
Name:Oxysterols receptor LXR-alpha
Type:Enzyme Catalytic Domain
Mol. Mass.:50403.85
Organism:Homo sapiens (Human)
Description:Q13133
Residue:447
BDBM50192109
NameBDBM50192109
Synonyms:2-(4-(benzyl(2,2,2-trifluoroethyl)amino)-3-chlorophenyl)-1,1,1,3,3,3-hexafluoropropan-2-ol | CHEMBL384246
TypeSmall organic molecule
Emp. Form.C18H13ClF9NO
Mol. Mass.465.741
SMILESOC(c1ccc(N(Cc2ccccc2)CC(F)(F)F)c(Cl)c1)(C(F)(F)F)C(F)(F)F