Reaction Details
TargetMelanin-concentrating hormone receptor 1
LigandBDBM50168507
Substrate/Competitorn/a
Meas. Tech.ChEMBL_421986 (CHEMBL856548)
Ki 12±n/a nM
Citation Kim, NMeyers, KMMendez-Andino, JLWarshakoon, NCJi, WWos, JAColson, AMitchell, MCDavis, JRPinney, BBReizes, OHu, XE Identification of substituted 4-aminopiperidines and 3-aminopyrrolidines as potent MCH-R1 antagonists for the treatment of obesity. Bioorg Med Chem Lett16:5445-50 (2006) 
 
Melanin-concentrating hormone receptor 1
Name:Melanin-concentrating hormone receptor 1
Type:G Protein-Coupled Receptor (GPCR)
Mol. Mass.:45976.27
Organism:Homo sapiens (Human)
Description:Membranes from CHO-K1 cells stably expressing human MCH1R were used in assays.
Residue:422
BDBM50168507
NameBDBM50168507
Synonyms:(E)-N-(1-cinnamylpiperidin-4-yl)-3,5-dimethoxybenzamide CHEMBL189602
TypeSmall organic molecule
Emp. Form.C23H28N2O3
Mol. Mass.380.48
SMILESCOc1cc(OC)cc(c1)C(=O)NC1CCN(C\C=C\c2ccccc2)CC1