Reaction Details
TargetMelanin-concentrating hormone receptor 1
LigandBDBM50192162
Substrate/Competitorn/a
Meas. Tech.ChEMBL_421986 (CHEMBL856548)
Ki 23±n/a nM
Citation Kim, NMeyers, KMMendez-Andino, JLWarshakoon, NCJi, WWos, JAColson, AMitchell, MCDavis, JRPinney, BBReizes, OHu, XE Identification of substituted 4-aminopiperidines and 3-aminopyrrolidines as potent MCH-R1 antagonists for the treatment of obesity. Bioorg Med Chem Lett16:5445-50 (2006) 
 
Melanin-concentrating hormone receptor 1
Name:Melanin-concentrating hormone receptor 1
Type:G Protein-Coupled Receptor (GPCR)
Mol. Mass.:45976.27
Organism:Homo sapiens (Human)
Description:Membranes from CHO-K1 cells stably expressing human MCH1R were used in assays.
Residue:422
BDBM50192162
NameBDBM50192162
Synonyms:3,5-dimethoxy-N-((3R)-1-((E)-4-phenylbut-3-en-2-yl)pyrrolidin-3-yl)benzamide | CHEMBL425084
TypeSmall organic molecule
Emp. Form.C23H28N2O3
Mol. Mass.380.48
SMILESCOc1cc(OC)cc(c1)C(=O)N[C@@H]1CCN(C1)C(C)\C=C\c1ccccc1