Reaction Details
TargetMelanin-concentrating hormone receptor 1
LigandBDBM50192169
Substrate/Competitorn/a
Meas. Tech.ChEMBL_421986 (CHEMBL856548)
Ki 7±n/a nM
Citation Kim, NMeyers, KMMendez-Andino, JLWarshakoon, NCJi, WWos, JAColson, AMitchell, MCDavis, JRPinney, BBReizes, OHu, XE Identification of substituted 4-aminopiperidines and 3-aminopyrrolidines as potent MCH-R1 antagonists for the treatment of obesity. Bioorg Med Chem Lett16:5445-50 (2006) 
 
Melanin-concentrating hormone receptor 1
Name:Melanin-concentrating hormone receptor 1
Type:G Protein-Coupled Receptor (GPCR)
Mol. Mass.:45976.27
Organism:Homo sapiens (Human)
Description:Membranes from CHO-K1 cells stably expressing human MCH1R were used in assays.
Residue:422
BDBM50192169
NameBDBM50192169
Synonyms:(R)-3,5-dimethoxy-N-(1-(naphthalen-2-ylmethyl)pyrrolidin-3-yl)benzamide | CHEMBL216362
TypeSmall organic molecule
Emp. Form.C24H26N2O3
Mol. Mass.390.4748
SMILESCOc1cc(OC)cc(c1)C(=O)N[C@@H]1CCN(Cc2ccc3ccccc3c2)C1