Reaction Details
TargetReverse transcriptase/RNaseH
LigandBDBM50193520
Substrate/Competitorn/a
Meas. Tech.ChEMBL_385312 (CHEMBL869229)
IC50 7600±n/a nM
Citation Deng, BLHartman, TLBuckheit, RWPannecouque, CDe Clercq, ECushman, M Replacement of the metabolically labile methyl esters in the alkenyldiarylmethane series of non-nucleoside reverse transcriptase inhibitors with isoxazolone, isoxazole, oxazolone, or cyano substituents. J Med Chem49:5316-23 (2006) 
 
Reverse transcriptase/RNaseH
Name:Reverse transcriptase/RNaseH
Type:PROTEIN
Mol. Mass.:65229.15
Organism:Human immunodeficiency virus 1
Description:ChEMBL_1473730
Residue:566
BDBM50193520
NameBDBM50193520
Synonyms:(E)-5-[1-(3-methoxy-7-methyl-benzo[d]isoxazol-5-yl)-4-(2-oxooxazolidin-3-yl)but-1-enyl]-2,7-dimethylbenzo[d]isoxazol-3-one | CHEMBL387003
TypeSmall organic molecule
Emp. Form.C25H25N3O6
Mol. Mass.463.4825
SMILESCOc1noc2c(C)cc(cc12)C(=C/CCN1CCOC1=O)\c1cc(C)c2on(C)c(=O)c2c1