Reaction Details
Target11-beta-hydroxysteroid dehydrogenase type 2
LigandBDBM50193785
Substrate/Competitorn/a
Meas. Tech.ChEMBL_424102 (CHEMBL856748)
IC50 15000±n/a nM
Citation Yeh, VSKurukulasuriya, RFung, SMonzon, KChiou, WWang, JStolarik, DImade, HShapiro, RKnourek-Segel, VBush, EWilcox, DNguyen, PTBrune, MJacobson, PLink, JT Discovery of orally active butyrolactam 11beta-HSD1 inhibitors. Bioorg Med Chem Lett16:5555-60 (2006) 
 
11-beta-hydroxysteroid dehydrogenase type 2
Name:11-beta-hydroxysteroid dehydrogenase type 2
Type:Enzyme
Mol. Mass.:44141.72
Organism:Homo sapiens (Human)
Description:Purified recombinant human 11beta-HSD2.
Residue:405
BDBM50193785
NameBDBM50193785
Synonyms:(3r,9r)-9-(4-((5-cyanopyridin-2-yloxy)methyl)-3,3-dimethyl-2-oxopyrrolidin-1-yl)bicyclo[3.3.1]nonane-3-carboxamide | CHEMBL221284
TypeSmall organic molecule
Emp. Form.C23H30N4O3
Mol. Mass.410.5093
SMILESCC1(C)C(COc2ccc(cn2)C#N)CN([C@H]2C3CCCC2C[C@H](C3)C(N)=O)C1=O