Reaction Details
Target11-beta-hydroxysteroid dehydrogenase 1
LigandBDBM50193783
Substrate/Competitorn/a
Meas. Tech.ChEMBL_424101 (CHEMBL856747)
Ki 50±n/a nM
Citation Yeh, VSKurukulasuriya, RFung, SMonzon, KChiou, WWang, JStolarik, DImade, HShapiro, RKnourek-Segel, VBush, EWilcox, DNguyen, PTBrune, MJacobson, PLink, JT Discovery of orally active butyrolactam 11beta-HSD1 inhibitors. Bioorg Med Chem Lett16:5555-60 (2006) 
 
11-beta-hydroxysteroid dehydrogenase 1
Name:11-beta-hydroxysteroid dehydrogenase 1
Type:Enzyme
Mol. Mass.:32409.16
Organism:Homo sapiens (Human)
Description:P28845
Residue:292
BDBM50193783
NameBDBM50193783
Synonyms:(1R,7S,8r)-ethyl 4-(4-((5-cyanopyridin-2-yloxy)methyl)-3,3-dimethyl-2-oxopyrrolidin-1-yl)bicyclo[5.1.0]octane-8-carboxylate | CHEMBL218943
TypeSmall organic molecule
Emp. Form.C24H31N3O4
Mol. Mass.425.5206
SMILESCCOC(=O)[C@@H]1[C@H]2CCC(CC[C@@H]12)N1CC(COc2ccc(cn2)C#N)C(C)(C)C1=O