Reaction Details
Target11-beta-hydroxysteroid dehydrogenase 1
LigandBDBM50193800
Substrate/Competitorn/a
Meas. Tech.ChEMBL_424101 (CHEMBL856747)
Ki 190±n/a nM
Citation Yeh, VSKurukulasuriya, RFung, SMonzon, KChiou, WWang, JStolarik, DImade, HShapiro, RKnourek-Segel, VBush, EWilcox, DNguyen, PTBrune, MJacobson, PLink, JT Discovery of orally active butyrolactam 11beta-HSD1 inhibitors. Bioorg Med Chem Lett16:5555-60 (2006) 
 
11-beta-hydroxysteroid dehydrogenase 1
Name:11-beta-hydroxysteroid dehydrogenase 1
Type:Enzyme
Mol. Mass.:32409.16
Organism:Homo sapiens (Human)
Description:P28845
Residue:292
BDBM50193800
NameBDBM50193800
Synonyms:4-(4-((5-cyanopyridin-2-yloxy)methyl)-3,3-dimethyl-2-oxopyrrolidin-1-yl)azepane-1-carboxamide | CHEMBL385584
TypeSmall organic molecule
Emp. Form.C20H27N5O3
Mol. Mass.385.4601
SMILESCC1(C)C(COc2ccc(cn2)C#N)CN(C2CCCN(CC2)C(N)=O)C1=O