Reaction Details
TargetMelanocortin receptor 5
LigandBDBM50193831
Substrate/Competitorn/a
Meas. Tech.ChEMBL_422338 (CHEMBL908723)
IC50 0.400000±n/a nM
Citation Cain, JPMayorov, AVCai, MWang, HTan, BChandler, KLee, YPetrov, RRTrivedi, DHruby, VJ Design, synthesis, and biological evaluation of a new class of small molecule peptide mimetics targeting the melanocortin receptors. Bioorg Med Chem Lett16:5462-7 (2006) 
 
Melanocortin receptor 5
Name:Melanocortin receptor 5
Type:Enzyme
Mol. Mass.:36612.92
Organism:Homo sapiens (Human)
Description:P33032
Residue:325
BDBM50193831
NameBDBM50193831
Synonyms:CHEMBL218558 | N-(6-((3S,8aS)-3-benzyl-hexahydropyrrolo[1,2-a]pyrazin-2(1H)-yl)-6-oxohexyl)-3-(1H-indol-3-yl)propanamide
TypeSmall organic molecule
Emp. Form.C31H40N4O2
Mol. Mass.500.6749
SMILESO=C(CCc1c[nH]c2ccccc12)NCCCCCC(=O)N1C[C@@H]2CCCN2C[C@@H]1Cc1ccccc1