Reaction Details
TargetMelanocortin receptor 4
LigandBDBM50193835
Substrate/Competitorn/a
Meas. Tech.ChEMBL_422337 (CHEMBL908722)
IC50>10000±n/a nM
Citation Cain, JPMayorov, AVCai, MWang, HTan, BChandler, KLee, YPetrov, RRTrivedi, DHruby, VJ Design, synthesis, and biological evaluation of a new class of small molecule peptide mimetics targeting the melanocortin receptors. Bioorg Med Chem Lett16:5462-7 (2006) 
 
Melanocortin receptor 4
Name:Melanocortin receptor 4
Type:Enzyme
Mol. Mass.:36949.50
Organism:Homo sapiens (Human)
Description:P32245
Residue:332
BDBM50193835
NameBDBM50193835
Synonyms:1-((3S,8aS)-3-benzyl-hexahydropyrrolo[1,2-a]pyrazin-2(1H)-yl)-2-phenylethanone | CHEMBL218748
TypeSmall organic molecule
Emp. Form.C22H26N2O
Mol. Mass.334.4546
SMILESO=C(Cc1ccccc1)N1C[C@@H]2CCCN2C[C@@H]1Cc1ccccc1