Reaction Details
TargetC-X-C chemokine receptor type 2
LigandBDBM50193982
Substrate/Competitorn/a
Meas. Tech.ChEMBL_424261 (CHEMBL908413)
IC50 12±n/a nM
Citation Nie, HWiddowson, KLPalovich, MRFu, WElliott, JDBryan, DLBurman, MSchmidt, DBFoley, JJSarau, HMBusch-Petersen, J N,N'-Diarylcyanoguanidines as antagonists of the CXCR2 and CXCR1 chemokine receptors. Bioorg Med Chem Lett16:5513-6 (2006) 
 
C-X-C chemokine receptor type 2
Name:C-X-C chemokine receptor type 2
Type:Protein
Mol. Mass.:40767.88
Organism:Homo sapiens (Human)
Description:P25025
Residue:360
BDBM50193982
NameBDBM50193982
Synonyms:3-(2-bromophenyl)-2-cyano-1-(2-hydroxy-3-{[3-(morpholin-4-yl)pentan-3-yl]sulfamoyl}phenyl)guanidine | CHEMBL218744
TypeSmall organic molecule
Emp. Form.C23H29BrN6O4S
Mol. Mass.565.483
SMILESCCC(CC)(NS(=O)(=O)c1cccc(N=C(NC#N)Nc2ccccc2Br)c1O)N1CCOCC1