Reaction Details
TargetC-X-C chemokine receptor type 1
LigandBDBM50193978
Substrate/Competitorn/a
Meas. Tech.ChEMBL_424262 (CHEMBL908414)
IC50 215±n/a nM
Citation Nie, HWiddowson, KLPalovich, MRFu, WElliott, JDBryan, DLBurman, MSchmidt, DBFoley, JJSarau, HMBusch-Petersen, J N,N'-Diarylcyanoguanidines as antagonists of the CXCR2 and CXCR1 chemokine receptors. Bioorg Med Chem Lett16:5513-6 (2006) 
 
C-X-C chemokine receptor type 1
Name:C-X-C chemokine receptor type 1
Type:Enzyme
Mol. Mass.:39803.83
Organism:Homo sapiens (Human)
Description:P25024
Residue:350
BDBM50193978
NameBDBM50193978
Synonyms:3-(2-bromophenyl)-1-[4-chloro-3-({3-[(2R,6S)-2,6-dimethylmorpholin-4-yl]pentan-3-yl}sulfamoyl)-2-hydroxyphenyl]-2-cyanoguanidine | CHEMBL218486
TypeSmall organic molecule
Emp. Form.C25H32BrClN6O4S
Mol. Mass.627.981
SMILESCCC(CC)(NS(=O)(=O)c1c(Cl)ccc(N=C(NC#N)Nc2ccccc2Br)c1O)N1C[C@H](C)O[C@H](C)C1