Reaction Details
TargetC-X-C chemokine receptor type 2
LigandBDBM50193983
Substrate/Competitorn/a
Meas. Tech.ChEMBL_424261 (CHEMBL908413)
IC50 112±n/a nM
Citation Nie, HWiddowson, KLPalovich, MRFu, WElliott, JDBryan, DLBurman, MSchmidt, DBFoley, JJSarau, HMBusch-Petersen, J N,N'-Diarylcyanoguanidines as antagonists of the CXCR2 and CXCR1 chemokine receptors. Bioorg Med Chem Lett16:5513-6 (2006) 
 
C-X-C chemokine receptor type 2
Name:C-X-C chemokine receptor type 2
Type:Protein
Mol. Mass.:40767.88
Organism:Homo sapiens (Human)
Description:P25025
Residue:360
BDBM50193983
NameBDBM50193983
Synonyms:1-[4-chloro-3-(dimethylsulfamoyl)-2-hydroxyphenyl]-2-cyano-3-[2-(propan-2-yl)phenyl]guanidine | CHEMBL218334
TypeSmall organic molecule
Emp. Form.C19H22ClN5O3S
Mol. Mass.435.928
SMILESCC(C)c1ccccc1NC(NC#N)=Nc1ccc(Cl)c(c1O)S(=O)(=O)N(C)C