Reaction Details
TargetC-X-C chemokine receptor type 2
LigandBDBM50193986
Substrate/Competitorn/a
Meas. Tech.ChEMBL_424261 (CHEMBL908413)
IC50 17±n/a nM
Citation Nie, HWiddowson, KLPalovich, MRFu, WElliott, JDBryan, DLBurman, MSchmidt, DBFoley, JJSarau, HMBusch-Petersen, J N,N'-Diarylcyanoguanidines as antagonists of the CXCR2 and CXCR1 chemokine receptors. Bioorg Med Chem Lett16:5513-6 (2006) 
 
C-X-C chemokine receptor type 2
Name:C-X-C chemokine receptor type 2
Type:Protein
Mol. Mass.:40767.88
Organism:Homo sapiens (Human)
Description:P25025
Residue:360
BDBM50193986
NameBDBM50193986
Synonyms:6-chloro-3-({(cyanoimino)[(2-methylphenyl)amino]methyl}amino)-2-hydroxy-N,N-dimethylbenzenesulfonamide | CHEMBL220860
TypeSmall organic molecule
Emp. Form.C17H18ClN5O3S
Mol. Mass.407.875
SMILESCN(C)S(=O)(=O)c1c(Cl)ccc(N=C(NC#N)Nc2ccccc2C)c1O