Reaction Details
TargetC-X-C chemokine receptor type 1
LigandBDBM50193985
Substrate/Competitorn/a
Meas. Tech.ChEMBL_424262 (CHEMBL908414)
IC50 192±n/a nM
Citation Nie, HWiddowson, KLPalovich, MRFu, WElliott, JDBryan, DLBurman, MSchmidt, DBFoley, JJSarau, HMBusch-Petersen, J N,N'-Diarylcyanoguanidines as antagonists of the CXCR2 and CXCR1 chemokine receptors. Bioorg Med Chem Lett16:5513-6 (2006) 
 
C-X-C chemokine receptor type 1
Name:C-X-C chemokine receptor type 1
Type:Enzyme
Mol. Mass.:39803.83
Organism:Homo sapiens (Human)
Description:P25024
Residue:350
BDBM50193985
NameBDBM50193985
Synonyms:3-{[[(2-bromophenyl)amino](cyanoimino)methyl]amino}-6-fluoro-2-hydroxy-N,N-dimethylbenzenesulfonamide | CHEMBL375393
TypeSmall organic molecule
Emp. Form.C16H15BrFN5O3S
Mol. Mass.456.289
SMILESCN(C)S(=O)(=O)c1c(F)ccc(N=C(NC#N)Nc2ccccc2Br)c1O