Reaction Details
TargetMuscarinic acetylcholine receptor M5
LigandBDBM50194655
Substrate/Competitorn/a
Meas. Tech.ChEMBL_395702 (CHEMBL909210)
Ki 3200±n/a nM
Citation Sagara, YSagara, TUchiyama, MOtsuki, SKimura, TFujikawa, TNoguchi, KOhtake, N Identification of a novel 4-aminomethylpiperidine class of M3 muscarinic receptor antagonists and structural insight into their M3 selectivity. J Med Chem49:5653-63 (2006) 
 
Muscarinic acetylcholine receptor M5
Name:Muscarinic acetylcholine receptor M5
Type:PROTEIN
Mol. Mass.:60102.35
Organism:Homo sapiens (Human)
Description:ChEMBL_1517990
Residue:532
BDBM50194655
NameBDBM50194655
Synonyms:(2R)-N-(1-cyclopentyl-4-piperidinylmethyl)-1-((2S,4R)-4-hydroxy-1-[3,3,3-tris(4-fluorophenyl)-propanoyl]pyrrolidine-2-yl)carbonylpyrrolidine-2-carboxamide | CHEMBL212645
TypeSmall organic molecule
Emp. Form.C42H49F3N4O4
Mol. Mass.730.8581
SMILESO[C@@H]1C[C@H](N(C1)C(=O)CC(c1ccc(F)cc1)(c1ccc(F)cc1)c1ccc(F)cc1)C(=O)N1CCC[C@@H]1C(=O)NCC1CCN(CC1)C1CCCC1