Reaction Details
TargetMitogen-activated protein kinase kinase kinase 8
LigandBDBM50194996
Substrate/Competitorn/a
Meas. Tech.ChEMBL_424645 (CHEMBL855706)
IC50>10000±n/a nM
Citation Hu, YGreen, NGavrin, LKJanz, KKaila, NLi, HQThomason, JRCuozzo, JWHall, JPHsu, SNickerson-Nutter, CTelliez, JBLin, LLTam, S Inhibition of Tpl2 kinase and TNFalpha production with quinoline-3-carbonitriles for the treatment of rheumatoid arthritis. Bioorg Med Chem Lett16:6067-72 (2006) 
 
Mitogen-activated protein kinase kinase kinase 8
Name:Mitogen-activated protein kinase kinase kinase 8
Type:Serine/threonine-protein kinase
Mol. Mass.:52916.89
Organism:Homo sapiens (Human)
Description:P41279
Residue:467
BDBM50194996
NameBDBM50194996
Synonyms:4-(3-chloro-4-fluorophenylthio)-6-(2-morpholinoethylamino)quinoline-3-carbonitrile | CHEMBL374785
TypeSmall organic molecule
Emp. Form.C22H20ClFN4OS
Mol. Mass.442.937
SMILESFc1ccc(Sc2c(cnc3ccc(NCCN4CCOCC4)cc23)C#N)cc1Cl