Reaction Details
TargetMitogen-activated protein kinase kinase kinase 8
LigandBDBM50194997
Substrate/Competitorn/a
Meas. Tech.ChEMBL_424645 (CHEMBL855706)
IC50>40000±n/a nM
Citation Hu, YGreen, NGavrin, LKJanz, KKaila, NLi, HQThomason, JRCuozzo, JWHall, JPHsu, SNickerson-Nutter, CTelliez, JBLin, LLTam, S Inhibition of Tpl2 kinase and TNFalpha production with quinoline-3-carbonitriles for the treatment of rheumatoid arthritis. Bioorg Med Chem Lett16:6067-72 (2006) 
 
Mitogen-activated protein kinase kinase kinase 8
Name:Mitogen-activated protein kinase kinase kinase 8
Type:Serine/threonine-protein kinase
Mol. Mass.:52916.89
Organism:Homo sapiens (Human)
Description:P41279
Residue:467
BDBM50194997
NameBDBM50194997
Synonyms:6-((1H-imidazol-4-yl)methylamino)-4-(3-chloro-4-fluorophenylamino)-2-hydroxyquinoline-3-carbonitrile | CHEMBL222882
TypeSmall organic molecule
Emp. Form.C20H14ClFN6O
Mol. Mass.408.816
SMILESFc1ccc(Nc2c(C#N)c(=O)[nH]c3ccc(NCc4cnc[nH]4)cc23)cc1Cl