Reaction Details
TargetMitogen-activated protein kinase kinase kinase 8
LigandBDBM50195012
Substrate/Competitorn/a
Meas. Tech.ChEMBL_424645 (CHEMBL855706)
IC50 19000±n/a nM
Citation Hu, YGreen, NGavrin, LKJanz, KKaila, NLi, HQThomason, JRCuozzo, JWHall, JPHsu, SNickerson-Nutter, CTelliez, JBLin, LLTam, S Inhibition of Tpl2 kinase and TNFalpha production with quinoline-3-carbonitriles for the treatment of rheumatoid arthritis. Bioorg Med Chem Lett16:6067-72 (2006) 
 
Mitogen-activated protein kinase kinase kinase 8
Name:Mitogen-activated protein kinase kinase kinase 8
Type:Serine/threonine-protein kinase
Mol. Mass.:52916.89
Organism:Homo sapiens (Human)
Description:P41279
Residue:467
BDBM50195012
NameBDBM50195012
Synonyms:6-((1H-imidazol-4-yl)methylamino)-4-(3-chloro-4-fluorophenylamino)-2-methylquinoline-3-carbonitrile | CHEMBL223587
TypeSmall organic molecule
Emp. Form.C21H16ClFN6
Mol. Mass.406.843
SMILESCc1nc2ccc(NCc3cnc[nH]3)cc2c(Nc2ccc(F)c(Cl)c2)c1C#N