Reaction Details
TargetSerine/threonine-protein kinase Chk1
LigandBDBM50195218
Substrate/Competitorn/a
Meas. Tech.ChEMBL_424833 (CHEMBL908460)
IC50 0.830000±n/a nM
Citation Huang, SGarbaccio, RMFraley, MESteen, JKreatsoulas, CHartman, GStirdivant, SDrakas, BRickert, KWalsh, EHamilton, KBuser, CAHardwick, JMao, XAbrams, MBeck, STao, WLobell, RSepp-Lorenzino, LYan, YIkuta, MMurphy, JZSardana, VMunshi, SKuo, LReilly, MMahan, E Development of 6-substituted indolylquinolinones as potent Chek1 kinase inhibitors. Bioorg Med Chem Lett16:5907-12 (2006) 
 
Serine/threonine-protein kinase Chk1
Name:Serine/threonine-protein kinase Chk1
Type:Enzyme Catalytic Domain
Mol. Mass.:54443.02
Organism:Homo sapiens (Human)
Description:gi_166295192
Residue:476
BDBM50195218
NameBDBM50195218
Synonyms:3-(5-(morpholinomethyl)-1H-indol-2-yl)-6-(1H-pyrazol-4-yl)quinolin-2(1H)-one | CHEMBL220601
TypeSmall organic molecule
Emp. Form.C25H23N5O2
Mol. Mass.425.4824
SMILESO=c1[nH]c2ccc(cc2cc1-c1cc2cc(CN3CCOCC3)ccc2[nH]1)-c1cn[nH]c1