Reaction Details
TargetSerine/threonine-protein kinase Chk1
LigandBDBM50195197
Substrate/Competitorn/a
Meas. Tech.ChEMBL_424833 (CHEMBL908460)
IC50 0.640000±n/a nM
Citation Huang, SGarbaccio, RMFraley, MESteen, JKreatsoulas, CHartman, GStirdivant, SDrakas, BRickert, KWalsh, EHamilton, KBuser, CAHardwick, JMao, XAbrams, MBeck, STao, WLobell, RSepp-Lorenzino, LYan, YIkuta, MMurphy, JZSardana, VMunshi, SKuo, LReilly, MMahan, E Development of 6-substituted indolylquinolinones as potent Chek1 kinase inhibitors. Bioorg Med Chem Lett16:5907-12 (2006) 
 
Serine/threonine-protein kinase Chk1
Name:Serine/threonine-protein kinase Chk1
Type:Enzyme Catalytic Domain
Mol. Mass.:54443.02
Organism:Homo sapiens (Human)
Description:gi_166295192
Residue:476
BDBM50195197
NameBDBM50195197
Synonyms:6-(isothiazol-4-yl)-3-(5-(piperidin-1-ylmethyl)-1H-indol-2-yl)quinolin-2(1H)-one | CHEMBL221554
TypeSmall organic molecule
Emp. Form.C26H24N4OS
Mol. Mass.440.56
SMILESO=c1[nH]c2ccc(cc2cc1-c1cc2cc(CN3CCCCC3)ccc2[nH]1)-c1cnsc1