Reaction Details
TargetSerine/threonine-protein kinase Chk1
LigandBDBM50195209
Substrate/Competitorn/a
Meas. Tech.ChEMBL_424833 (CHEMBL908460)
IC50 1.1±n/a nM
Citation Huang, SGarbaccio, RMFraley, MESteen, JKreatsoulas, CHartman, GStirdivant, SDrakas, BRickert, KWalsh, EHamilton, KBuser, CAHardwick, JMao, XAbrams, MBeck, STao, WLobell, RSepp-Lorenzino, LYan, YIkuta, MMurphy, JZSardana, VMunshi, SKuo, LReilly, MMahan, E Development of 6-substituted indolylquinolinones as potent Chek1 kinase inhibitors. Bioorg Med Chem Lett16:5907-12 (2006) 
 
Serine/threonine-protein kinase Chk1
Name:Serine/threonine-protein kinase Chk1
Type:Enzyme Catalytic Domain
Mol. Mass.:54443.02
Organism:Homo sapiens (Human)
Description:gi_166295192
Residue:476
BDBM50195209
NameBDBM50195209
Synonyms:6-(1-methyl-1H-pyrazol-4-yl)-3-(5-(piperidin-1-ylmethyl)-1H-indol-2-yl)quinolin-2(1H)-one | CHEMBL221864
TypeSmall organic molecule
Emp. Form.C27H27N5O
Mol. Mass.437.5362
SMILESCn1cc(cn1)-c1ccc2[nH]c(=O)c(cc2c1)-c1cc2cc(CN3CCCCC3)ccc2[nH]1