Reaction Details
TargetcGMP-dependent protein kinase
LigandBDBM50195444
Substrate/Competitorn/a
Meas. Tech.ChEMBL_424969 (CHEMBL910725)
IC50 0.1±n/a nM
Citation Feng, DFisher, MLiang, GBQian, XBrown, CGurnett, ALeavitt, PSLiberator, PAMathew, JMisura, ASamaras, STamas, TSchmatz, DMWyvratt, MBiftu, T Synthesis and SAR of 2-(4-fluorophenyl)-3-pyrimidin-4-ylimidazo[1,2-a]pyridine derivatives as anticoccidial agents. Bioorg Med Chem Lett16:5978-81 (2006) 
 
cGMP-dependent protein kinase
Name:cGMP-dependent protein kinase
Synonyms:n/a
Type:PROTEIN
Mol. Mass.:112911.27
Organism:Eimeria tenella
Description:ChEMBL_469577
Residue:1003
BDBM50195444
NameBDBM50195444
TypeSmall organic molecule
Emp. Form.C30H30FN5O
Mol. Mass.495.5905
SMILESCCN(CCO)Cc1ccn2c(c(nc2c1)-c1ccc(F)cc1)-c1ccnc(n1)[C@@H](C)c1ccccc1