Reaction Details
TargetEphrin type-B receptor 4
LigandBDBM50195883
Substrate/Competitorn/a
Meas. Tech.ChEMBL_452960 (CHEMBL902105)
IC50 575±n/a nM
Citation Miyazaki, YNakano, MSato, HTruesdale, ATStuart, JDNartey, ENHightower, KEKane-Carson, L Design and effective synthesis of novel templates, 3,7-diphenyl-4-amino-thieno and furo-[3,2-c]pyridines as protein kinase inhibitors and in vitro evaluation targeting angiogenetic kinases. Bioorg Med Chem Lett17:250-4 (2006) 
 
Ephrin type-B receptor 4
Name:Ephrin type-B receptor 4
Type:Enzyme
Mol. Mass.:108273.51
Organism:Homo sapiens (Human)
Description:P54760
Residue:987
BDBM50195883
NameBDBM50195883
Synonyms:7-bromo-3-(3-chloro-4-fluorophenyl)thieno[3,2-c]pyridin-4-amine | CHEMBL239180
TypeSmall organic molecule
Emp. Form.C13H7BrClFN2S
Mol. Mass.357.628
SMILESNc1ncc(Br)c2scc(-c3ccc(F)c(Cl)c3)c12