Reaction Details
TargetAngiopoietin-1 receptor
LigandBDBM50195879
Substrate/Competitorn/a
Meas. Tech.ChEMBL_452958 (CHEMBL902103)
IC50>20000±n/a nM
Citation Miyazaki, YNakano, MSato, HTruesdale, ATStuart, JDNartey, ENHightower, KEKane-Carson, L Design and effective synthesis of novel templates, 3,7-diphenyl-4-amino-thieno and furo-[3,2-c]pyridines as protein kinase inhibitors and in vitro evaluation targeting angiogenetic kinases. Bioorg Med Chem Lett17:250-4 (2006) 
 
Angiopoietin-1 receptor
Name:Angiopoietin-1 receptor
Type:Enzyme
Mol. Mass.:125835.70
Organism:Homo sapiens (Human)
Description:Q02763
Residue:1124
BDBM50195879
NameBDBM50195879
Synonyms:3-(4-amino-3-(3-chloro-4-fluorophenyl)thieno[3,2-c]pyridin-7-yl)benzenesulfonamide | CHEMBL241517
TypeSmall organic molecule
Emp. Form.C19H13ClFN3O2S2
Mol. Mass.433.907
SMILESNc1ncc(-c2cccc(c2)S(N)(=O)=O)c2scc(-c3ccc(F)c(Cl)c3)c12