Reaction Details
TargetEphrin type-B receptor 4
LigandBDBM50195892
Substrate/Competitorn/a
Meas. Tech.ChEMBL_452960 (CHEMBL902105)
IC50 59±n/a nM
Citation Miyazaki, YNakano, MSato, HTruesdale, ATStuart, JDNartey, ENHightower, KEKane-Carson, L Design and effective synthesis of novel templates, 3,7-diphenyl-4-amino-thieno and furo-[3,2-c]pyridines as protein kinase inhibitors and in vitro evaluation targeting angiogenetic kinases. Bioorg Med Chem Lett17:250-4 (2006) 
 
Ephrin type-B receptor 4
Name:Ephrin type-B receptor 4
Type:Enzyme
Mol. Mass.:108273.51
Organism:Homo sapiens (Human)
Description:P54760
Residue:987
BDBM50195892
NameBDBM50195892
Synonyms:3-(3-chloro-4-fluorophenyl)-7-(3-(methylsulfonyl)phenyl)thieno[3,2-c]pyridin-4-amine | CHEMBL391691
TypeSmall organic molecule
Emp. Form.C20H14ClFN2O2S2
Mol. Mass.432.919
SMILESCS(=O)(=O)c1cccc(c1)-c1cnc(N)c2c(csc12)-c1ccc(F)c(Cl)c1