Reaction Details
TargetGonadotropin-releasing hormone receptor
LigandBDBM50133856
Substrate/Competitorn/a
Meas. Tech.ChEMBL_411201 (CHEMBL907221)
IC50 200±n/a nM
Citation Betz, SFLio, FMGao, YReinhart, GJGuo, ZMesleh, MFZhu, YFStruthers, RS Determination of the binding mode of thienopyrimidinedione antagonists to the human gonadotropin releasing hormone receptor using structure-activity relationships, site-directed mutagenesis, and homology modeling. J Med Chem49:6170-6 (2006) 
 
Gonadotropin-releasing hormone receptor
Name:Gonadotropin-releasing hormone receptor
Type:Enzyme
Mol. Mass.:37749.45
Organism:Homo sapiens (Human)
Description:P30968
Residue:328
BDBM50133856
NameBDBM50133856
Synonyms:1-(2,6-Difluoro-benzyl)-5-{[methyl-(2-pyridin-2-yl-ethyl)-amino]-methyl}-6-(4-nitro-phenyl)-3-phenyl-1H-thieno[2,3-d]pyrimidine-2,4-dione CHEMBL333518
TypeSmall organic molecule
Emp. Form.C34H27F2N5O4S
Mol. Mass.639.671
SMILESCN(CCc1ccccn1)Cc1c(sc2n(Cc3c(F)cccc3F)c(=O)n(-c3ccccc3)c(=O)c12)-c1ccc(cc1)[N+]([O-])=O