Reaction Details
TargetGonadotropin-releasing hormone receptor
LigandBDBM50133848
Substrate/Competitorn/a
Meas. Tech.ChEMBL_411209 (CHEMBL907229)
IC50>10000±n/a nM
Citation Betz, SFLio, FMGao, YReinhart, GJGuo, ZMesleh, MFZhu, YFStruthers, RS Determination of the binding mode of thienopyrimidinedione antagonists to the human gonadotropin releasing hormone receptor using structure-activity relationships, site-directed mutagenesis, and homology modeling. J Med Chem49:6170-6 (2006) 
 
Gonadotropin-releasing hormone receptor
Name:Gonadotropin-releasing hormone receptor
Type:Enzyme
Mol. Mass.:37749.45
Organism:Homo sapiens (Human)
Description:P30968
Residue:328
BDBM50133848
NameBDBM50133848
Synonyms:1-(2,6-Difluoro-benzyl)-5-[(methyl-phenethyl-amino)-methyl]-6-(4-nitro-phenyl)-3-phenyl-1H-thieno[2,3-d]pyrimidine-2,4-dione CHEMBL120260
TypeSmall organic molecule
Emp. Form.C35H28F2N4O4S
Mol. Mass.638.683
SMILESCN(CCc1ccccc1)Cc1c(sc2n(Cc3c(F)cccc3F)c(=O)n(-c3ccccc3)c(=O)c12)-c1ccc(cc1)[N+]([O-])=O