Reaction Details
TargetProstaglandin G/H synthase 2
LigandBDBM22360
Substrate/Competitorn/a
Meas. Tech.ChEMBL_432351 (CHEMBL914991)
IC50>100000±n/a nM
Citation Zheng, XOda, HTakamatsu, KSugimoto, YTai, AAkaho, EAli, HIOshiki, TKakuta, HSasaki, K Analgesic agents without gastric damage: design and synthesis of structurally simple benzenesulfonanilide-type cyclooxygenase-1-selective inhibitors. Bioorg Med Chem15:1014-21 (2006) 
 
Prostaglandin G/H synthase 2
Name:Prostaglandin G/H synthase 2
Type:Protein
Mol. Mass.:68976.98
Organism:Ovis aries (Sheep)
Description:n/a
Residue:603
BDBM22360
NameBDBM22360
Synonyms:2-(acetyloxy)benzoate Acetylsalicylic acid Endosprin Zorprin cid_2244
TypeAnti-Inflammatory Agents, Non-Steroidal
Emp. Form.C9H8O4
Mol. Mass.180.1574
SMILESCC(=O)Oc1ccccc1C(O)=O