Reaction Details
TargetC-C chemokine receptor type 2
LigandBDBM50197978
Substrate/Competitorn/a
Meas. Tech.ChEMBL_453298 (CHEMBL902453)
IC50 44±n/a nM
Citation Pinkerton, ABHuang, DCube, RVHutchinson, JHStruthers, MAyala, JMVicario, PPPatel, SRWisniewski, TDeMartino, JAVernier, JM Diaryl substituted pyrazoles as potent CCR2 receptor antagonists. Bioorg Med Chem Lett17:807-13 (2007) 
 
C-C chemokine receptor type 2
Name:C-C chemokine receptor type 2
Type:Enzyme
Mol. Mass.:41932.32
Organism:Homo sapiens (Human)
Description:P41597
Residue:374
BDBM50197978
NameBDBM50197978
Synonyms:3-(3-(3,5-dichlorophenyl)-1-(naphthalen-2-yl)-1H-pyrazol-5-yloxy)-N-(1-(diethylamino)heptan-4-yl)propanamide | CHEMBL239143
TypeSmall organic molecule
Emp. Form.C33H40Cl2N4O2
Mol. Mass.595.602
SMILESCCCC(CCCN(CC)CC)NC(=O)CCOc1cc(nn1-c1ccc2ccccc2c1)-c1cc(Cl)cc(Cl)c1